Reaction Details
TargetAngiotensin-converting enzyme
LigandBDBM50280471
Substrate/Competitorn/a
Meas. Tech.ChEBML_34906
IC50 0.090000±n/a nM
Citation Burkholder, TPLe, TBGiroux, ELFlynn, GA Acid-catalyzed O-allylation of β-hydroxy-α-amino acids: an entry into conformationally constrained dipeptide surrogates Bioorg Med Chem Lett2:579-582 (1992)    Article
 
Angiotensin-converting enzyme
Name:Angiotensin-converting enzyme
Type:n/a
Mol. Mass.:150405.15
Organism:Oryctolagus cuniculus
Description:n/a
Residue:1310
BDBM50280471
NameBDBM50280471
Synonyms:(R)-6-((R)-(S)-1-Carboxy-3-phenyl-propylamino)-5-oxo-3,4,5,6,7,11b-hexahydro-1H-2-oxa-4a-aza-dibenzo[a,c]cycloheptene-4-carboxylic acid; hydrochloride | CHEMBL554951
TypeSmall organic molecule
Emp. Form.C24H26N2O6
Mol. Mass.438.473
SMILESOC(=O)[C@H](CCc1ccccc1)NC1Cc2ccccc2C2COC[C@@H](N2C1=O)C(O)=O