Reaction Details
TargetMuscarinic acetylcholine receptor M4
LigandBDBM50076089
Substrate/Competitorn/a
Meas. Tech.ChEBML_139250
Kd 5.4±n/a nM
Citation Kozikowski, APFauq, AHMiller, JHMcKinney, M Alzheimer's therapy: an approach to novel muscarinic ligands based upon the naturally occurring alkaloid himbacine. Bioorg Med Chem Lett2:797-802 (1992)    Article
 
Muscarinic acetylcholine receptor M4
Name:Muscarinic acetylcholine receptor M4
Type:Enzyme Catalytic Domain
Mol. Mass.:52841.70
Organism:RAT
Description:Cholinergic, muscarinic M4 CHRM4 RAT::P08485
Residue:477
BDBM50076089
NameBDBM50076089
Synonyms:(3S,3aR,4R,4aS,8aR,9aS)-3-Methyl-4-[2-((R)-1-methyl-6-(S)-methyl-piperidin-2-yl)-vinyl]-decahydro-naphtho[2,3-c]furan-1-one (3S,3aR,4R,4aS,8aR,9aS)-4-[(E)-2-((2R,6S)-1,6-Dimethyl-piperidin-2-yl)-vinyl]-3-methyl-decahydro-naphtho[2,3-c]furan-1-one 4-[2-(1,6-Dimethyl-piperidin-2-yl)-vinyl]-3-methyl-decahydro-naphtho[2,3-c]furan-1-one CHEMBL277642
TypeSmall organic molecule
Emp. Form.C22H35NO2
Mol. Mass.345.5188
SMILESC[C@@H]1OC(=O)[C@H]2C[C@H]3CCCC[C@@H]3[C@@H](\C=C\[C@H]3CCC[C@H](C)N3C)[C@@H]12