Reaction Details
TargetMuscarinic acetylcholine receptor M1
LigandBDBM50280521
Substrate/Competitorn/a
Meas. Tech.ChEBML_138398
Kd 9700±n/a nM
Citation Kozikowski, APFauq, AHMiller, JHMcKinney, M Alzheimer's therapy: an approach to novel muscarinic ligands based upon the naturally occurring alkaloid himbacine. Bioorg Med Chem Lett2:797-802 (1992)    Article
 
Muscarinic acetylcholine receptor M1
Name:Muscarinic acetylcholine receptor M1
Type:Protein
Mol. Mass.:51442.54
Organism:Homo sapiens (Human)
Description:P11229
Residue:460
BDBM50280521
NameBDBM50280521
Synonyms:(4R,5S)-5-Methyl-4-[(E)-3-((R)-1-methyl-piperidin-2-yl)-allyl]-dihydro-furan-2-one | CHEMBL22923
TypeSmall organic molecule
Emp. Form.C14H23NO2
Mol. Mass.237.3379
SMILESC[C@@H]1OC(=O)C[C@H]1C\C=C\[C@H]1CCCCN1C