Reaction Details
TargetMuscarinic acetylcholine receptor M2
LigandBDBM50009291
Substrate/Competitorn/a
Meas. Tech.ChEBML_140043
IC50 4460±n/a nM
Citation Sanders, KBThomas, AJPavia, MRDavis, RECoughenour, LLMyers, SLFisher, SMoos, WH Cholinergic agents: aldehyde, ketone, and oxime analogues of the muscarinic agonist UH5 Bioorg Med Chem Lett2:803-808 (1992)    Article
 
Muscarinic acetylcholine receptor M2
Name:Muscarinic acetylcholine receptor M2
Type:Enzyme Catalytic Domain
Mol. Mass.:51555.53
Organism:RAT
Description:P10980
Residue:466
BDBM50009291
NameBDBM50009291
Synonyms:CHEMBL75358 | N-(4-Dimethylamino-but-2-ynyl)-N-methyl-acetamide
TypeSmall organic molecule
Emp. Form.C9H16N2O
Mol. Mass.168.2361
SMILESCN(C)CC#CCN(C)C(C)=O