Reaction Details
TargetMuscarinic acetylcholine receptor M1/M2/M3/M4/M5
LigandBDBM50006584
Substrate/Competitorn/a
Meas. Tech.ChEMBL_139939 (CHEMBL748171)
IC50 25±n/a nM
Citation Tecle, HMirzadegan, TMoos, WHMoreland, DWPavia, MRSchwarz, RDDavis, RE A rationale for the design and synthesis of m1 selective muscarinic agonists. Bioorg Med Chem Lett2:821-826 (1992)    Article
 
Muscarinic acetylcholine receptor M1/M2/M3/M4/M5
Name:Muscarinic acetylcholine receptor M1/M2/M3/M4/M5
Synonyms:Muscarinic acetylcholine receptor
Type:n/a
Mol. Mass.:n/a
Description:ASSAY_ID of ChEMBL is 1821274
Components:This complex has 5 components.
Component 1
Name:Muscarinic acetylcholine receptor M1
Type:Enzyme Catalytic Domain
Mol. Mass.:51390.46
Organism:RAT
Description:P08482
Residue:460
Component 2
Name:Muscarinic acetylcholine receptor M3
Synonyms:ACM3_RAT Chrm-3 | Chrm3
Type:Enzyme Catalytic Domain
Mol. Mass.:66086.66
Organism:RAT
Description:Cholinergic, muscarinic M3 CHRM3 RAT::P08483
Residue:589
Component 3
Name:Muscarinic acetylcholine receptor M4
Synonyms:ACM4_RAT Chrm-4 | Chrm4
Type:Enzyme Catalytic Domain
Mol. Mass.:52841.70
Organism:RAT
Description:Cholinergic, muscarinic M4 CHRM4 RAT::P08485
Residue:477
Component 4
Name:Muscarinic acetylcholine receptor M5
Synonyms:ACM5_RAT Chrm-5 Muscarinic acetylcholine receptor | Muscarinic acetylcholine receptor M5
Type:Enzyme Catalytic Domain
Mol. Mass.:60161.80
Organism:RAT
Description:Cholinergic, muscarinic M5 CHRM5 RAT::P08911
Residue:531
Component 5
Name:Muscarinic acetylcholine receptor M2
Synonyms:ACM2_RAT Chrm-2 | Chrm2
Type:Enzyme Catalytic Domain
Mol. Mass.:51555.53
Organism:RAT
Description:P10980
Residue:466
BDBM50006584
NameBDBM50006584
Synonyms:(McN-A-343) [4-(3-Chloro-phenylcarbamoyloxy)-but-2-ynyl]-trimethyl-ammonium; chloride 4-(3-chlorophenylcarbamoyloxy)-N,N,N-trimethylbut-2-yn-1-aminium CHEMBL40554 McN-A-343 [4-(3-Chloro-phenylcarbamoyloxy)-but-2-ynyl]-trimethyl-ammonium; chloride (McN-A-343)
TypeSmall organic molecule
Emp. Form.C14H18ClN2O2
Mol. Mass.281.757
SMILESC[N+](C)(C)CC#CCOC(=O)Nc1cccc(Cl)c1