Reaction Details
TargetAcetylcholinesterase
LigandBDBM50060470
Substrate/Competitorn/a
Meas. Tech.ChEBML_27996
IC50 12±n/a nM
Citation Gregor, VEEmmerling, MRLee, CMoore, CJ The synthesis and in vitro acetylcholinesterase and butyrylcholinesterase inhibitory activity of tacrine (Cognex®) derivaties Bioorg Med Chem Lett2:861-864 (1992)    Article
 
Acetylcholinesterase
Name:Acetylcholinesterase
Type:Enzyme
Mol. Mass.:71812.79
Organism:Electrophorus electricus (Electric eel)
Description:n/a
Residue:633
BDBM50060470
NameBDBM50060470
Synonyms:10-azatetracyclo[10.2.1.02,11.04,9]pentadeca-2,4,6,8,10-pentaen-3-amine 3-azatetracyclo[10.2.1.0^{2,11}.0^{4,9}]pentadeca-2(11),3,5,7,9-pentaen-10-amine CHEMBL431844
TypeSmall organic molecule
Emp. Form.C14H14N2
Mol. Mass.210.2744
SMILESNc1c2C3CCC(C3)c2nc2ccccc12