Reaction Details
TargetCysteinyl leukotriene receptor 1
LigandBDBM50280709
Substrate/Competitorn/a
Meas. Tech.ChEMBL_99866 (CHEMBL706791)
IC50 0.600000±n/a nM
Citation Labelle, MPrasit, PBelley, MBlouin, MChampion, ECharette, LDeLuca, JGDufresne, CFrenette, RGauthier, JYGrimm, EGrossman, SJGuay, DHerold, EGJones, TRLau, CKLeblanc, YLéger, SLord, AMcAuliffe, M The discovery of a new structural class of potent orally active leukotriene D4 antagonists Bioorg Med Chem Lett2:1141-1146 (1992)    Article
 
Cysteinyl leukotriene receptor 1
Name:Cysteinyl leukotriene receptor 1
Type:Enzyme Catalytic Domain
Mol. Mass.:39007.58
Organism:GUINEA PIG
Description:Leukotriene D4 0 GUINEA PIG::Q2NNR5
Residue:340
BDBM50280709
NameBDBM50280709
Synonyms:CHEMBL15344 | Sodium; 2-[1-[3-(7-chloro-quinolin-2-ylmethoxy)-phenyl]-3-(2-methanesulfonyl-phenyl)-propylsulfanylmethyl]-butyrate
TypeSmall organic molecule
Emp. Form.C31H31ClNO5S2
Mol. Mass.597.165
SMILESCCC(CSC(CCc1ccccc1S(C)(=O)=O)c1cccc(OCc2ccc3ccc(Cl)cc3n2)c1)C([O-])=O