Reaction Details
TargetGlutamate receptor ionotropic, NMDA 1
LigandBDBM50001266
Substrate/Competitorn/a
Meas. Tech.ChEBML_140324
Ki 40±n/a nM
Citation Smith, ECMcQuaid, LACalligaro, DOO'Malley, PJ Structure-activity relationships of a series of glycine antagonists related to 5,7-dichlorokynurenic acid and 3-(2-carboxy-6-chloroindol-3-yl)acetic acid Bioorg Med Chem Lett3:81-84 (1993)    Article
 
Glutamate receptor ionotropic, NMDA 1
Name:Glutamate receptor ionotropic, NMDA 1
Type:Enzyme Catalytic Domain
Mol. Mass.:105533.40
Organism:RAT
Description:P35439
Residue:938
BDBM50001266
NameBDBM50001266
Synonyms:5,7-DICHLORO-4-HYDROXYQUINOLINE-2-CARBOXYLIC ACID 5,7-Dichloro-4-hydroxy-quinoline-2-carboxylic acid anion 5,7-Dichloro-4-oxo-1,4-dihydro-quinoline-2-carboxylic acid CHEMBL50267
TypeSmall organic molecule
Emp. Form.C10H5Cl2NO3
Mol. Mass.258.058
SMILESOC(=O)c1cc(O)c2c(Cl)cc(Cl)cc2n1