Reaction Details
TargetMuscarinic acetylcholine receptor M1/M2/M3/M4/M5
LigandBDBM50280830
Substrate/Competitorn/a
Meas. Tech.ChEMBL_138336 (CHEMBL747766)
IC50>100±n/a nM
Citation Mignani, SDamour, DDoble, ALabaudinière, RMalleron, JLPiot, OGueremy, C New indole derivatives as potent and selective serotonin uptake inhibitors Bioorg Med Chem Lett3:1913-1918 (1993)    Article
 
Muscarinic acetylcholine receptor M1/M2/M3/M4/M5
Name:Muscarinic acetylcholine receptor M1/M2/M3/M4/M5
Synonyms:Muscarinic acetylcholine receptor
Type:n/a
Mol. Mass.:n/a
Description:ASSAY_ID of ChEMBL is 329940
Components:This complex has 5 components.
Component 1
Name:Muscarinic acetylcholine receptor M2
Type:GPCR
Mol. Mass.:51730.61
Organism:Homo sapiens (Human)
Description:P08172
Residue:466
Component 2
Name:Muscarinic acetylcholine receptor M3
Synonyms:ACM3_HUMAN Cholinergic, muscarinic M3 Muscarinic receptor M3 | RecName: Full=Muscarinic acetylcholine receptor M3
Type:Enzyme
Mol. Mass.:66151.03
Organism:Homo sapiens (Human)
Description:P20309
Residue:590
Component 3
Name:Muscarinic acetylcholine receptor M5
Synonyms:ACM5_HUMAN | CHRM5
Type:PROTEIN
Mol. Mass.:60102.35
Organism:Homo sapiens (Human)
Description:ChEMBL_1517990
Residue:532
Component 4
Name:Muscarinic acetylcholine receptor M1
Synonyms:ACM1_HUMAN Cholinergic receptor, muscarinic 1 | Cholinergic, muscarinic M1
Type:Protein
Mol. Mass.:51442.54
Organism:Homo sapiens (Human)
Description:P11229
Residue:460
Component 5
Name:Muscarinic acetylcholine receptor M4
Synonyms:ACM4_HUMAN Cholinergic, muscarinic M4 Muscarinic acetylcholine receptor M2 and M4
Type:Enzyme Catalytic Domain
Mol. Mass.:53079.31
Organism:Homo sapiens (Human)
Description:Cholinergic, muscarinic M4 CHRM4 HUMAN M3::P08173
Residue:479
BDBM50280830
NameBDBM50280830
Synonyms:3-{2-[4-(5-Fluoro-1H-indol-3-ylmethyl)-piperidin-1-yl]-ethyl}-1H-quinazoline-2,4-dione | CHEMBL300585
TypeSmall organic molecule
Emp. Form.C24H25FN4O2
Mol. Mass.420.4793
SMILESFc1ccc2[nH]cc(CC3CCN(CCn4c(=O)[nH]c5ccccc5c4=O)CC3)c2c1