Reaction Details
TargetAlpha-1A/Alpha-1B/Alpha-1D adrenergic receptor
LigandBDBM50280820
Substrate/Competitorn/a
Meas. Tech.ChEMBL_33416 (CHEMBL648812)
IC50>100±n/a nM
Citation Mignani, SDamour, DDoble, ALabaudinière, RMalleron, JLPiot, OGueremy, C New indole derivatives as potent and selective serotonin uptake inhibitors Bioorg Med Chem Lett3:1913-1918 (1993)    Article
 
Alpha-1A/Alpha-1B/Alpha-1D adrenergic receptor
Name:Alpha-1A/Alpha-1B/Alpha-1D adrenergic receptor
Synonyms:Alpha-1 adrenergic receptor
Type:n/a
Mol. Mass.:n/a
Description:ASSAY_ID of ChEMBL is 33416
Components:This complex has 3 components.
Component 1
Name:Alpha-1D adrenergic receptor
Type:Enzyme
Mol. Mass.:59890.14
Organism:Mus musculus (Mouse)
Description:P97714
Residue:562
Component 2
Name:Alpha-1B adrenergic receptor
Synonyms:ADA1B_MOUSE Alpha-1 adrenergic receptor
Type:Enzyme
Mol. Mass.:56439.49
Organism:Mus musculus (Mouse)
Description:P97717
Residue:514
Component 3
Name:Alpha-1A adrenergic receptor
Synonyms:ADA1A_MOUSE Adra1c | Alpha-1 adrenergic receptor
Type:Enzyme
Mol. Mass.:51769.32
Organism:Mus musculus (Mouse)
Description:P97718
Residue:466
BDBM50280820
NameBDBM50280820
Synonyms:1-{2-[4-(5-Fluoro-1H-indol-3-ylmethyl)-piperidin-1-yl]-ethyl}-2-methoxy-1H-perimidine | CHEMBL418276
TypeSmall organic molecule
Emp. Form.C28H29FN4O
Mol. Mass.456.5545
SMILESCOc1nc2cccc3cccc(n1CCN1CCC(Cc4c[nH]c5ccc(F)cc45)CC1)c23