Reaction Details
TargetMyosin light chain kinase, smooth muscle
LigandBDBM3033
Substrate/Competitorn/a
Meas. Tech.ChEBML_161608
IC50 5800±n/a nM
Citation Kleinschroth, JHartenstein, JRudolph, CSchächtele, C Non-glycosidic/non-aminoalkyl-substituted indolocarbazoles as inhibitors of protein kinase C Bioorg Med Chem Lett3:1959-1964 (1993)    Article
 
Myosin light chain kinase, smooth muscle
Name:Myosin light chain kinase, smooth muscle
Type:Enzyme
Mol. Mass.:210423.57
Organism:Gallus gallus (chicken)
Description:n/a
Residue:1906
BDBM3033
NameBDBM3033
Synonyms:3-{23-methyl-14-oxo-3,13,23-triazahexacyclo[14.7.0.0^{2,10}.0^{4,9}.0^{11,15}.0^{17,22}]tricosa-1(16),2(10),4(9),5,7,11(15),17,19,21-nonaen-3-yl}propanenitrile Go 6976 | Indolocarbazole deriv.
TypeSmall organic molecule
Emp. Form.C24H18N4O
Mol. Mass.378.4259
SMILESCn1c2ccccc2c2c3C(=O)NCc3c3c4ccccc4n(CCC#N)c3c12