Reaction Details
TargetProtein kinase C alpha/beta/delta/epsilon/eta/gamma/theta/zeta type
LigandBDBM2579
Substrate/Competitorn/a
Meas. Tech.ChEMBL_162388 (CHEMBL767476)
IC50 9±n/a nM
Citation Kleinschroth, JHartenstein, JRudolph, CSchächtele, C Non-glycosidic/non-aminoalkyl-substituted indolocarbazoles as inhibitors of protein kinase C Bioorg Med Chem Lett3:1959-1964 (1993)    Article
 
Protein kinase C alpha/beta/delta/epsilon/eta/gamma/theta/zeta type
Name:Protein kinase C alpha/beta/delta/epsilon/eta/gamma/theta/zeta type
Synonyms:Protein kinase C (PKC)
Type:n/a
Mol. Mass.:n/a
Description:ASSAY_ID of ChEMBL is 162388
Components:This complex has 8 components.
Component 1
Name:Protein kinase C delta type
Type:PROTEIN
Mol. Mass.:77531.57
Organism:Rattus norvegicus
Description:ChEMBL_104731
Residue:673
Component 2
Name:Protein kinase C eta type
Synonyms:KPCL_RAT Pkch Protein kinase C eta type | nPKC-eta
Type:PROTEIN
Mol. Mass.:77961.39
Organism:Rattus norvegicus
Description:ChEMBL_104731
Residue:683
Component 3
Name:Protein kinase C theta type
Synonyms:KPCT_RAT Prkcq nPKC-theta
Type:PROTEIN
Mol. Mass.:81765.17
Organism:Rattus norvegicus
Description:ChEMBL_104731
Residue:707
Component 4
Name:Protein kinase C alpha type
Synonyms:KPCA_RAT Prkca Protein kinase C alpha | Protein kinase C alpha type
Type:Protein
Mol. Mass.:76797.67
Organism:Rattus norvegicus (Rat)
Description:P05696
Residue:672
Component 5
Name:Protein kinase C gamma type
Synonyms:KPCG_RAT Pkcg Prkcg Protein kinase C gamma
Type:PROTEIN
Mol. Mass.:78367.88
Organism:Rattus norvegicus
Description:ChEMBL_152979
Residue:697
Component 6
Name:Protein kinase C zeta type
Synonyms:KPCZ_RAT Prkcz Protein kinase C zeta type | nPKC-zeta
Type:PROTEIN
Mol. Mass.:67722.31
Organism:Rattus norvegicus
Description:ChEMBL_104731
Residue:592
Component 7
Name:Protein kinase C epsilon type
Synonyms:KPCE_RAT Prkce Protein kinase C epsilon nPKC-epsilon
Type:PROTEIN
Mol. Mass.:83483.06
Organism:Rattus norvegicus
Description:ChEMBL_160964
Residue:737
Component 8
Name:Protein kinase C beta type
Synonyms:KPCB_RAT Pkcb Prkcb1 Protein kinase C (PKC) | Protein kinase C beta
Type:Enzyme Mixture
Mol. Mass.:76755.54
Organism:Rattus norvegicus (rat)
Description:PKC from rat brain is known to contain predominately the conventional PKC isoforms, alpha, beta I, beta II, gamma.
Residue:671
BDBM2579
NameBDBM2579
Synonyms:(2S,3R,4R,6R)-3-methoxy-2-methyl-4-(methylamino)-29-oxa-1,7,17-triazaoctacyclo[12.12.2.1^{2,6}.0^{7,28}.0^{8,13}.0^{15,19}.0^{20,27}.0^{21,26}]nonacosa-8(13),9,11,14(28),15(19),20(27),21(26),22,24-nonaen-16-one Staurosporin, 4 Staurosporine, 8 US9206188, Staurosporine | US9226923, Staurosporine
TypeSmall organic molecule
Emp. Form.C28H26N4O3
Mol. Mass.466.531
SMILESCN[C@@H]1C[C@H]2O[C@@](C)([C@@H]1OC)n1c3ccccc3c3c4CNC(=O)c4c4c5ccccc5n2c4c13