Reaction Details
TargetTrypanothione reductase
LigandBDBM50280881
Substrate/Competitorn/a
Meas. Tech.ChEBML_211972
Ki 92000±n/a nM
Citation Tromelin, AMoutiez, MMeziane-Cherif, DAumercier, MTartar, ASergheraert, C Synthesis of non reducible inhibitors for trypanothione reductase from Trypanosoma cruziBioorg Med Chem Lett3:1971-1976 (1993)    Article
 
Trypanothione reductase
Name:Trypanothione reductase
Type:Homodimer; oxidoreductase
Mol. Mass.:53868.26
Organism:Trypanosoma cruzi
Description:n/a
Residue:492
BDBM50280881
NameBDBM50280881
Synonyms:(2-(2-Benzyloxycarbonylamino-2-{[(3-dimethylamino-propylcarbamoyl)-methyl]-carbamoyl}-ethylsulfanyl)-1-{[(3-dimethylamino-propylcarbamoyl)-methyl]-carbamoyl}-ethyl)-carbamic acid benzyl ester | CHEMBL302322
TypeSmall organic molecule
Emp. Form.C36H54N8O8S
Mol. Mass.758.928
SMILESCN(C)CCCNC(=O)CNC(=O)C(CSCC(NC(=O)OCc1ccccc1)C(=O)NCC(=O)NCCCN(C)C)NC(=O)OCc1ccccc1