Reaction Details
TargetAmine oxidase [flavin-containing] A
LigandBDBM50280981
Substrate/Competitorn/a
Meas. Tech.ChEBML_122780
Ki 340000±n/a nM
Citation Ding, CZSilverman, RB Selective inactivation of monoamine oxidase B by aminoethyl 3-chlorobenzyl ether Bioorg Med Chem Lett3:2077-2078 (1993)    Article
 
Amine oxidase [flavin-containing] A
Name:Amine oxidase [flavin-containing] A
Type:PROTEIN
Mol. Mass.:59764.63
Organism:Bos taurus
Description:ChEMBL_1501477
Residue:527
BDBM50280981
NameBDBM50280981
Synonyms:2-(3-Chloro-benzyloxy)-ethylamine | CHEMBL65135
TypeSmall organic molecule
Emp. Form.C9H12ClNO
Mol. Mass.185.651
SMILESNCCOCc1cccc(Cl)c1