Reaction Details
TargetAmine oxidase [flavin-containing] B
LigandBDBM50280981
Substrate/Competitorn/a
Meas. Tech.ChEBML_123741
Ki 5000±n/a nM
Citation Ding, CZSilverman, RB Selective inactivation of monoamine oxidase B by aminoethyl 3-chlorobenzyl ether Bioorg Med Chem Lett3:2077-2078 (1993)    Article
 
Amine oxidase [flavin-containing] B
Name:Amine oxidase [flavin-containing] B
Type:PROTEIN
Mol. Mass.:58428.94
Organism:Bos taurus
Description:ChEMBL_1501478
Residue:520
BDBM50280981
NameBDBM50280981
Synonyms:2-(3-Chloro-benzyloxy)-ethylamine | CHEMBL65135
TypeSmall organic molecule
Emp. Form.C9H12ClNO
Mol. Mass.185.651
SMILESNCCOCc1cccc(Cl)c1