Reaction Details
TargetChymotrypsin-like elastase family member 2A
LigandBDBM50281086
Substrate/Competitorn/a
Meas. Tech.ChEMBL_194721 (CHEMBL807702)
IC50 37000±n/a nM
Citation Adonias, MAnayaba, JCámara, JCanet, EGateau-Olesker, AGero, SDGrande, MHernando, JI Enantioselective synthesis and antielastase activity of 1,3,4-trisubstituted and 3,4-disubstituted β-lactam antibiotics Bioorg Med Chem Lett3:2547-2552 (1993)    Article
 
Chymotrypsin-like elastase family member 2A
Name:Chymotrypsin-like elastase family member 2A
Type:PROTEIN
Mol. Mass.:28894.94
Organism:Rattus norvegicus
Description:ChEMBL_194721
Residue:271
BDBM50281086
NameBDBM50281086
Synonyms:(3S,4S)-1,4-Diacetyl-3-butyl-azetidin-2-one | CHEMBL418925
TypeSmall organic molecule
Emp. Form.C11H17NO3
Mol. Mass.211.2576
SMILESCCCC[C@H]1[C@H](N(C(C)=O)C1=O)C(C)=O