Reaction Details
TargetAcetylcholinesterase
LigandBDBM50281126
Substrate/Competitorn/a
Meas. Tech.ChEBML_27804
Ki 0.003700±n/a nM
Citation Nair, HKQuinn, DM m-Alkyl, α,α,α-trifluoroacetophenones: A new class of potent transition state analog inhibitors of acetylcholinesterase Bioorg Med Chem Lett3:2619-2622 (1993)    Article
 
Acetylcholinesterase
Name:Acetylcholinesterase
Type:n/a
Mol. Mass.:65900.74
Organism:Tetronarce californica (Pacific electric ray) (Torpedo californica)
Description:P04058
Residue:586
BDBM50281126
NameBDBM50281126
Synonyms:1-(3-tert-Butyl-phenyl)-2,2,2-trifluoro-ethanone | CHEMBL89354
TypeSmall organic molecule
Emp. Form.C12H13F3O
Mol. Mass.230.2262
SMILESCC(C)(C)c1cccc(c1)C(=O)C(F)(F)F