Reaction Details
TargetAdenosine receptor A1
LigandBDBM50281133
Substrate/Competitorn/a
Meas. Tech.ChEBML_29639
Ki 11±n/a nM
Citation Knutsen, LJLau, JSheardown, MJThomsen, C The synthesis and biochemical evaluation of new A1 selective adenosine receptor agonists containing 6-hydrazinopurine moieties Bioorg Med Chem Lett3:2661-2666 (1993)    Article
 
Adenosine receptor A1
Name:Adenosine receptor A1
Type:Protein
Mol. Mass.:36704.13
Organism:Rattus norvegicus (rat)
Description:n/a
Residue:326
BDBM50281133
NameBDBM50281133
Synonyms:(2R,3R,4S,5R)-2-[2-Chloro-6-(3-hydroxy-piperidin-1-ylamino)-purin-9-yl]-5-hydroxymethyl-tetrahydro-furan-3,4-diol | CHEMBL327195
TypeSmall organic molecule
Emp. Form.C15H21ClN6O5
Mol. Mass.400.817
SMILESOC[C@H]1O[C@H]([C@H](O)[C@@H]1O)n1cnc2c(NN3CCCC(O)C3)nc(Cl)nc12