Reaction Details
TargetAdenosine receptor A1
LigandBDBM50281150
Substrate/Competitorn/a
Meas. Tech.ChEBML_29639
Ki 11±n/a nM
Citation Knutsen, LJLau, JSheardown, MJThomsen, C The synthesis and biochemical evaluation of new A1 selective adenosine receptor agonists containing 6-hydrazinopurine moieties Bioorg Med Chem Lett3:2661-2666 (1993)    Article
 
Adenosine receptor A1
Name:Adenosine receptor A1
Type:Protein
Mol. Mass.:36704.13
Organism:Rattus norvegicus (rat)
Description:n/a
Residue:326
BDBM50281150
NameBDBM50281150
Synonyms:(2R,3R,4S,5R)-2-[2-Chloro-6-(4-phenyl-piperidin-1-ylamino)-purin-9-yl]-5-hydroxymethyl-tetrahydro-furan-3,4-diol | CHEMBL413506
TypeSmall organic molecule
Emp. Form.C21H25ClN6O4
Mol. Mass.460.914
SMILESOC[C@H]1O[C@H]([C@H](O)[C@@H]1O)n1cnc2c(NN3CCC(CC3)c3ccccc3)nc(Cl)nc12