Reaction Details
TargetCaspase-1
LigandBDBM50281182
Substrate/Competitorn/a
Meas. Tech.ChEBML_90983
Ki 42±n/a nM
Citation Mjalli, AMChapman, KTMacCoss, MThornberry, NA Phenylalkyl ketones as potent reversible inhibitors of interleukin-1β converting enzyme Bioorg Med Chem Lett3:2689-2692 (1993)    Article
 
Caspase-1
Name:Caspase-1
Type:Enzyme
Mol. Mass.:45154.13
Organism:Homo sapiens (Human)
Description:P29466
Residue:404
BDBM50281182
NameBDBM50281182
Synonyms:3-(2-{2-[2-Acetylamino-3-(4-hydroxy-phenyl)-propionylamino]-3-methyl-butyrylamino}-propionylamino)-4-oxo-8-phenyl-octanoic acid | CHEMBL31803
TypeSmall organic molecule
Emp. Form.C33H44N4O8
Mol. Mass.624.7245
SMILESCC(C)[C@H](NC(=O)[C@H](Cc1ccc(O)cc1)NC(C)=O)C(=O)N[C@@H](C)C(=O)N[C@@H](CC(O)=O)C(=O)CCCCc1ccccc1