Reaction Details
TargetRenin
LigandBDBM50281229
Substrate/Competitorn/a
Meas. Tech.ChEBML_196101
pH7±n/a
IC50 11±n/a nM
Commentsextracted
Citation Poss, MAReid, JAFree, CARogers, WWeber, HRyono, DEDejneka, TDeForrest, JMWaldron, TLBrittain, RJWeller, HNCimarusti, MPPetrillo, EW Diol sulfonamides: A potent and novel class of inhibitors of human renin Bioorg Med Chem Lett3:2739-2744 (1993)    Article
 
Renin
Name:Renin
Type:Enzyme
Mol. Mass.:45058.99
Organism:Homo sapiens (Human)
Description:n/a
Residue:406
BDBM50281229
NameBDBM50281229
Synonyms:1H-Indole-2-carboxylic acid [(S)-1-[4-((S,S,R)-butylsulfamoyl)-1-cyclohexylmethyl-2,3-dihydroxy-butylcarbamoyl]-2-(3H-imidazol-4-yl)-ethyl]-amide | CHEMBL92377
TypeSmall organic molecule
Emp. Form.C30H44N6O6S
Mol. Mass.616.772
SMILESCCCCNS(=O)(=O)C[C@@H](O)[C@H](O)[C@H](CC1CCCCC1)NC(=O)[C@H](Cc1cnc[nH]1)NC(=O)c1cc2ccccc2[nH]1