Reaction Details
TargetVoltage-dependent L-type calcium channel subunit alpha-1S
LigandBDBM50281271
Substrate/Competitorn/a
Meas. Tech.ChEBML_42767
Ki 540±n/a nM
Citation Atwal, KSAhmed, SZFloyd, DMMoreland, SHedberg, A (cis)-3-methyl-1,5-benzothiazepine-4-ones: potent analogs of the calcium channel blocker diltiazen Bioorg Med Chem Lett3:2797-2800 (1993)    Article
 
Voltage-dependent L-type calcium channel subunit alpha-1S
Name:Voltage-dependent L-type calcium channel subunit alpha-1S
Type:PROTEIN
Mol. Mass.:212348.33
Organism:Homo sapiens (Human)
Description:ChEMBL_42767
Residue:1873
BDBM50281271
NameBDBM50281271
Synonyms:(2R,3S)-5-(2-Dimethylamino-ethyl)-2-(4-methoxy-phenyl)-3-methyl-2,3-dihydro-5H-benzo[b][1,4]thiazepin-4-one | CHEMBL262509
TypeSmall organic molecule
Emp. Form.C21H26N2O2S
Mol. Mass.370.508
SMILESCOc1ccc(cc1)[C@@H]1Sc2ccccc2N(CCN(C)C)C(=O)[C@@H]1C