Reaction Details
TargetPepsin A
LigandBDBM201
Substrate/Competitorn/a
Meas. Tech.ChEBML_153972
IC50 1000±n/a nM
Citation Fässler, ARösel, JGrüther, MTintelnot-Blomley, MAtteri, EBold, GLang, M Novel pseudosymmetric inhibitors of HIV-1 protease Bioorg Med Chem Lett3:2837-2842 (1993)    Article
 
Pepsin A
Name:Pepsin A
Type:Enzyme
Mol. Mass.:41232.87
Organism:Porcine
Description:n/a
Residue:385
BDBM201
NameBDBM201
Synonyms:(2S)-N-[(2S,3S)-4-[(2S)-N'-(cyclohexylmethyl)-2-acetamido-3-methylbutanehydrazido]-3-hydroxy-1-phenylbutan-2-yl]-2-acetamido-3-methylbutanamide | CGP 53820
Typen/a
Emp. Form.C31H51N5O5
Mol. Mass.573.7671
SMILESCC(C)[C@H](NC(C)=O)C(=O)N[C@@H](Cc1ccccc1)[C@@H](O)CN(CC1CCCCC1)NC(=O)[C@@H](NC(C)=O)C(C)C