Reaction Details
TargetEnvelope glycoprotein gp160
LigandBDBM50281339
Substrate/Competitorn/a
Meas. Tech.ChEBML_39914
IC50>100000±n/a nM
Citation Jarvest, RLBreen, ALEdge, CMChaikin, MAJennings, LJTruneh, ASweet, RWHertzberg, RP Structure-directed discovery of an inhibitor of the binding of HIV GP120 to the CD4 receptor Bioorg Med Chem Lett3:2851-2856 (1993)    Article
 
Envelope glycoprotein gp160
Name:Envelope glycoprotein gp160
Type:n/a
Mol. Mass.:97241.93
Organism:Human immunodeficiency virus type 1 group M subtype B (isolate HXB2)
Description:n/a
Residue:856
BDBM50281339
NameBDBM50281339
Synonyms:(S)-2-{(S)-2-[(4S,9S)-9-((R)-1-Amino-2-hydroxy-ethyl)-4-hydroxymethyl-3,6,10-trioxo-[1,2,5]triazecan-2-yl]-3-phenyl-propionylamino}-4-methyl-pentanoic acid [1-((S)-(R)-1-benzylcarbamoyl)-2-hydroxy-propyl]-amide | CHEMBL329691
TypeSmall organic molecule
Emp. Form.C36H51N7O9
Mol. Mass.725.8316
SMILESCC(C)C[C@H](NC(=O)[C@H](Cc1ccccc1)N1NC(=O)[C@@H](CCC(=O)N[C@@H](CO)C1=O)[C@@H](N)CO)C(=O)N[C@@H]([C@@H](C)O)C(=O)NCc1ccccc1