Reaction Details
TargetEnvelope glycoprotein gp160
LigandBDBM50280411
Substrate/Competitorn/a
Meas. Tech.ChEBML_39914
IC50 300000±n/a nM
Citation Jarvest, RLBreen, ALEdge, CMChaikin, MAJennings, LJTruneh, ASweet, RWHertzberg, RP Structure-directed discovery of an inhibitor of the binding of HIV GP120 to the CD4 receptor Bioorg Med Chem Lett3:2851-2856 (1993)    Article
 
Envelope glycoprotein gp160
Name:Envelope glycoprotein gp160
Type:n/a
Mol. Mass.:97241.93
Organism:Human immunodeficiency virus type 1 group M subtype B (isolate HXB2)
Description:n/a
Residue:856
BDBM50280411
NameBDBM50280411
Synonyms:(R)-2-[((R)-1-Methoxyoxalyl-pyrrolidine-2-carbonyl)-amino]-3-phenyl-propionic acid benzyl ester | CHEMBL318846
TypeSmall organic molecule
Emp. Form.C24H26N2O6
Mol. Mass.438.473
SMILESCOC(=O)C(=O)N1CCC[C@@H]1C(=O)N[C@H](Cc1ccccc1)C(=O)OCc1ccccc1