Reaction Details
Target3-phosphoshikimate 1-carboxyvinyltransferase
LigandBDBM50281343
Substrate/Competitorn/a
Meas. Tech.ChEMBL_65094 (CHEMBL670571)
Ki 1500±n/a nM
Citation Corey, SDPansegrau, PDWalker, MCSikorski, JA EPSP synthase inhibitor deisgn III. Synthesis & evaluation of a new 5-oxamic acid analog of EPSP which incorporates a malonate ether as a 3-phosphate mimic Bioorg Med Chem Lett3:2857-2862 (1993)    Article
 
3-phosphoshikimate 1-carboxyvinyltransferase
Name:3-phosphoshikimate 1-carboxyvinyltransferase
Type:PROTEIN
Mol. Mass.:46089.22
Organism:Escherichia coli (strain K12)
Description:ChEMBL_65087
Residue:427
BDBM50281343
NameBDBM50281343
Synonyms:(3R,4S,5R)-5-Carboxymethoxy-4-hydroxy-3-phosphonooxy-cyclohex-1-enecarboxylic acid | CHEMBL318618
TypeSmall organic molecule
Emp. Form.C9H13O10P
Mol. Mass.312.1673
SMILESO[C@H]1[C@@H](CC(=C[C@H]1OP(O)(O)=O)C(O)=O)OCC(O)=O