Reaction Details
Target3-phosphoshikimate 1-carboxyvinyltransferase
LigandBDBM50281354
Substrate/Competitorn/a
Meas. Tech.ChEMBL_64961 (CHEMBL676327)
Ki 78000±n/a nM
Citation Knowles, WSAnderson, KSAndrew, SSPhillion, DPReam, JEJohnson, KASikorski, JA Synthesis & characterization of N-amino-glyphosate as a potent analog inhibitor of E. coli EPSP synthase. Bioorg Med Chem Lett3:2863-2868 (1993)    Article
 
3-phosphoshikimate 1-carboxyvinyltransferase
Name:3-phosphoshikimate 1-carboxyvinyltransferase
Type:PROTEIN
Mol. Mass.:46089.22
Organism:Escherichia coli (strain K12)
Description:ChEMBL_65087
Residue:427
BDBM50281354
NameBDBM50281354
Synonyms:(Methyl-phosphonomethyl-amino)-acetic acid | CHEMBL97756
TypeSmall organic molecule
Emp. Form.C4H10NO5P
Mol. Mass.183.0997
SMILESCN(CC(O)=O)CP(O)(O)=O