Reaction Details
Target3-phosphoshikimate 1-carboxyvinyltransferase
LigandBDBM50281347
Substrate/Competitorn/a
Meas. Tech.ChEBML_65093
IC50>80000±n/a nM
Citation Knowles, WSAnderson, KSAndrew, SSPhillion, DPReam, JEJohnson, KASikorski, JA Synthesis & characterization of N-amino-glyphosate as a potent analog inhibitor of E. coli EPSP synthase. Bioorg Med Chem Lett3:2863-2868 (1993)    Article
 
3-phosphoshikimate 1-carboxyvinyltransferase
Name:3-phosphoshikimate 1-carboxyvinyltransferase
Type:PROTEIN
Mol. Mass.:46089.22
Organism:Escherichia coli (strain K12)
Description:ChEMBL_65087
Residue:427
BDBM50281347
NameBDBM50281347
Synonyms:2-(Phosphonomethyl-amino)-propionic acid | CHEMBL98731
TypeSmall organic molecule
Emp. Form.C4H10NO5P
Mol. Mass.183.0997
SMILESCC(NCP(O)(O)=O)C(O)=O