Reaction Details
TargetGag-Pol polyprotein [489-587]
LigandBDBM50281466
Substrate/Competitorn/a
Meas. Tech.ChEBML_79957
Ki 1±n/a nM
Citation Schirlin, DBaltzer, SDorsselaer, VVWeber, FWeill, CAltenburger, JMNeises, BFlynn, GRémy, JMTarnus, C Short and unexpectedly potent difluorostatone type inhibitors of HIV-1 protease Bioorg Med Chem Lett3:253-258 (1993)    Article
 
Gag-Pol polyprotein [489-587]
Name:Gag-Pol polyprotein [489-587]
Type:Enzyme Subunit
Mol. Mass.:10781.16
Organism:Human immunodeficiency virus type 1
Description:P04585[489-587]
Residue:99
BDBM50281466
NameBDBM50281466
Synonyms:CHEMBL86651 | [1-(1-Benzyl-3-benzylcarbamoyl-3,3-difluoro-2-oxo-propylcarbamoyl)-2-methyl-propyl]-carbamic acid benzyl ester
TypeSmall organic molecule
Emp. Form.C31H33F2N3O5
Mol. Mass.565.6076
SMILESCC(C)C(NC(=O)OCc1ccccc1)C(=O)NC(Cc1ccccc1)C(=O)C(F)(F)C(=O)NCc1ccccc1