Reaction Details
TargetSigma non-opioid intracellular receptor 1
LigandBDBM50281497
Substrate/Competitorn/a
Meas. Tech.ChEBML_201269
Ki 1.75±n/a nM
Citation Wustrow, DJWise, LDPugsley, TAMeltzer, LTHeffner, TG 4-Aryltetrahydropyridines as selective σ ligands Bioorg Med Chem Lett3:277-280 (1993)    Article
 
Sigma non-opioid intracellular receptor 1
Name:Sigma non-opioid intracellular receptor 1
Type:Enzyme Catalytic Domain
Mol. Mass.:25124.85
Organism:Homo sapiens (Human)
Description:Q99720
Residue:223
BDBM50281497
NameBDBM50281497
Synonyms:4-{4-[4-(4-Fluoro-phenyl)-3,6-dihydro-2H-pyridin-1-yl]-butyl}-pyridine | CHEMBL421195
TypeSmall organic molecule
Emp. Form.C20H23FN2
Mol. Mass.310.4084
SMILESFc1ccc(cc1)C1=CCN(CCCCc2ccncc2)CC1