Reaction Details
TargetSigma non-opioid intracellular receptor 1
LigandBDBM50281504
Substrate/Competitorn/a
Meas. Tech.ChEBML_201269
Ki 2.13±n/a nM
Citation Wustrow, DJWise, LDPugsley, TAMeltzer, LTHeffner, TG 4-Aryltetrahydropyridines as selective σ ligands Bioorg Med Chem Lett3:277-280 (1993)    Article
 
Sigma non-opioid intracellular receptor 1
Name:Sigma non-opioid intracellular receptor 1
Type:Enzyme Catalytic Domain
Mol. Mass.:25124.85
Organism:Homo sapiens (Human)
Description:Q99720
Residue:223
BDBM50281504
NameBDBM50281504
Synonyms:4-[4-(4-Thiophen-2-yl-3,6-dihydro-2H-pyridin-1-yl)-butyl]-pyridine | CHEMBL97302
TypeSmall organic molecule
Emp. Form.C18H22N2S
Mol. Mass.298.446
SMILESC(CCc1ccncc1)CN1CCC(=CC1)c1cccs1