Reaction Details
TargetType-1 angiotensin II receptor
LigandBDBM50281521
Substrate/Competitorn/a
Meas. Tech.ChEBML_36774
IC50 3100±n/a nM
Citation Murray, WVLalan, PGill, AAddo, MFLewis, JMLee, DKWachter, MPRampulla, RUnderwood, DC Substituted pyrrolidin-2-one biphenyltetrazoles as angiotensin II antagonists Bioorg Med Chem Lett3:369-374 (1993)    Article
 
Type-1 angiotensin II receptor
Name:Type-1 angiotensin II receptor
Type:PROTEIN
Mol. Mass.:41107.81
Organism:Bos taurus
Description:ChEMBL_36779
Residue:359
BDBM50281521
NameBDBM50281521
Synonyms:CHEMBL330866 | [3-Methyl-5-oxo-1-[2'-(1H-tetrazol-5-yl)-biphenyl-4-ylmethyl]-pyrrolidin-(2Z)-ylidene]-acetic acid ethyl ester
TypeSmall organic molecule
Emp. Form.C23H23N5O3
Mol. Mass.417.4604
SMILESCCOC(=O)\C=C1\C(C)CC(=O)N1Cc1ccc(cc1)-c1ccccc1-c1nnn[nH]1