Reaction Details
TargetType-1 angiotensin II receptor
LigandBDBM50281524
Substrate/Competitorn/a
Meas. Tech.ChEBML_36774
IC50 100±n/a nM
Citation Murray, WVLalan, PGill, AAddo, MFLewis, JMLee, DKWachter, MPRampulla, RUnderwood, DC Substituted pyrrolidin-2-one biphenyltetrazoles as angiotensin II antagonists Bioorg Med Chem Lett3:369-374 (1993)    Article
 
Type-1 angiotensin II receptor
Name:Type-1 angiotensin II receptor
Type:PROTEIN
Mol. Mass.:41107.81
Organism:Bos taurus
Description:ChEMBL_36779
Residue:359
BDBM50281524
NameBDBM50281524
Synonyms:CHEMBL123713 | [3,3-Diethyl-5-oxo-1-[2'-(1H-tetrazol-5-yl)-biphenyl-4-ylmethyl]-pyrrolidin-(2Z)-ylidene]-acetic acid ethyl ester
TypeSmall organic molecule
Emp. Form.C26H29N5O3
Mol. Mass.459.5402
SMILESCCOC(=O)\C=C1/N(Cc2ccc(cc2)-c2ccccc2-c2nnn[nH]2)C(=O)CC1(CC)CC