Reaction Details
TargetKappa-type opioid receptor
LigandBDBM50281660
Substrate/Competitorn/a
Meas. Tech.ChEBML_145964
Ki 160±n/a nM
Citation Higginbottom, MNolan, WO'Toole, JRatcliffe, GSRees, DCRoberts, E The design and synthesis of kappa opioid ligands based on a binding model for kappa agonists Bioorg Med Chem Lett3:841-846 (1993)    Article
 
Kappa-type opioid receptor
Name:Kappa-type opioid receptor
Type:G Protein-Coupled Receptor (GPCR)
Mol. Mass.:42648.76
Organism:Homo sapiens (Human)
Description:P41145
Residue:380
BDBM50281660
NameBDBM50281660
Synonyms:CHEMBL353654 PD-148282
TypeSmall organic molecule
Emp. Form.C25H34N2O2
Mol. Mass.394.5497
SMILESCN(C1CCCCC1)C(=O)Cc1c(OCCN2CCCC2)ccc2ccccc12