Reaction Details
TargetCholecystokinin receptor type A
LigandBDBM50002477
Substrate/Competitorn/a
Meas. Tech.ChEBML_49574
IC50 1800±n/a nM
Citation Shiosaki, KLin, CWLeanna, MRMorton, HEMiller, TRWitte, DStashko, MNadzan, AM Toward developing peptidomimetics: Successful replacement of backbone amide bonds in tetrapeptide-based CCK-A receptor agonists Bioorg Med Chem Lett3:855-860 (1993)    Article
 
Cholecystokinin receptor type A
Name:Cholecystokinin receptor type A
Type:n/a
Mol. Mass.:48229.77
Organism:Cavia porcellus
Description:n/a
Residue:430
BDBM50002477
NameBDBM50002477
Synonyms:(S)-3-{(S)-2-[(S)-2-tert-Butoxycarbonylamino-3-(1H-indol-3-yl)-propionylamino]-4-methylsulfanyl-butyrylamino}-N-((S)-1-carbamoyl-2-phenyl-ethyl)-succinamic acid 3-{2-[2-tert-Butoxycarbonylamino-3-(1H-indol-3-yl)-propionylamino]-4-methylsulfanyl-butyrylamino}-N-(1-carbamoyl-2-phenyl-ethyl)-succinamic acid CHEMBL64605
TypeSmall organic molecule
Emp. Form.C34H44N6O8S
Mol. Mass.696.814
SMILESCSCC[C@H](NC(=O)[C@H](Cc1c[nH]c2ccccc12)NC(=O)OC(C)(C)C)C(=O)N[C@@H](CC(O)=O)C(=O)N[C@@H](Cc1ccccc1)C(N)=O