Reaction Details
TargetCholecystokinin receptor type A
LigandBDBM50243981
Substrate/Competitorn/a
Meas. Tech.ChEMBL_50202 (CHEMBL663495)
IC50>100000±n/a nM
Citation Evans, BERittle, KEChang, RSLotti, VJFreedman, SBFreidinger, RM Multipurpose receptor ligands: β-carboline cholecystokinin antagonists Bioorg Med Chem Lett3:867-870 (1993)    Article
 
Cholecystokinin receptor type A
Name:Cholecystokinin receptor type A
Type:Enzyme Catalytic Domain
Mol. Mass.:49676.37
Organism:RAT
Description:Cholecystokinin central 0 RAT::P30551
Residue:444
BDBM50243981
NameBDBM50243981
Synonyms:Beta CCM Methyl Beta-carboline-3 carboxylate | methyl 9H-pyrido[3,4-b]indole-3-carboxylate
TypeSmall organic molecule
Emp. Form.C13H10N2O2
Mol. Mass.226.2307
SMILESCOC(=O)c1cc2c(cn1)[nH]c1ccccc21