Reaction Details
TargetGastrin/cholecystokinin type B receptor
LigandBDBM50449787
Substrate/Competitorn/a
Meas. Tech.ChEBML_48269
IC50 1.7±n/a nM
Citation Higginbottom, MHorwell, DCRoberts, E Selective ligands for cholecystokinin receptor subtypes CCK-A and CCK-B within a single structural class Bioorg Med Chem Lett3:881-884 (1993)    Article
 
Gastrin/cholecystokinin type B receptor
Name:Gastrin/cholecystokinin type B receptor
Type:Enzyme Catalytic Domain
Mol. Mass.:49196.59
Organism:MOUSE
Description:Cholecystokinin A CCKBR MOUSE::P56481
Residue:453
BDBM50449787
NameBDBM50449787
Synonyms:CHEMBL2062154 | PD-134308
TypeSmall organic molecule
Emp. Form.C35H42N4O6
Mol. Mass.614.7312
SMILES[H][C@@]12C[C@@]3([H])C[C@@]([H])(C1)C(OC(=O)N[C@](C)(Cc1c[nH]c4ccccc14)C(=O)NC[C@H](NC(=O)CCC(O)=O)c1ccccc1)[C@@]([H])(C2)C3