Reaction Details
TargetGastrin/cholecystokinin type B receptor
LigandBDBM50062005
Substrate/Competitorn/a
Meas. Tech.ChEBML_48269
IC50 0.150000±n/a nM
Citation Higginbottom, MHorwell, DCRoberts, E Selective ligands for cholecystokinin receptor subtypes CCK-A and CCK-B within a single structural class Bioorg Med Chem Lett3:881-884 (1993)    Article
 
Gastrin/cholecystokinin type B receptor
Name:Gastrin/cholecystokinin type B receptor
Type:Enzyme Catalytic Domain
Mol. Mass.:49196.59
Organism:MOUSE
Description:Cholecystokinin A CCKBR MOUSE::P56481
Residue:453
BDBM50062005
NameBDBM50062005
Synonyms:(S)-3-[(R)-2-(Adamantan-2-yloxycarbonylamino)-3-(1H-indol-3-yl)-2-methyl-propionylamino]-4-phenyl-butyric acid CHEMBL138534 | PD-135666
TypeSmall organic molecule
Emp. Form.C33H39N3O5
Mol. Mass.557.6799
SMILESC[C@](Cc1c[nH]c2ccccc12)(NC(=O)OC1C2CC3CC(C2)CC1C3)C(=O)N[C@H](CC(O)=O)Cc1ccccc1