Reaction Details
TargetNeurotensin receptor type 1
LigandBDBM50130880
Substrate/Competitorn/a
Meas. Tech.ChEBML_144293
Ki 0.170000±n/a nM
Citation Henry, JAHorwell, DCMeecham, KGRees, DC A structure-affinity study of the amino acid side-chains in neurotensin : N and C terminal deletions and Ala-scan Bioorg Med Chem Lett3:949-952 (1993)    Article
 
Neurotensin receptor type 1
Name:Neurotensin receptor type 1
Type:Enzyme Catalytic Domain
Mol. Mass.:47237.04
Organism:MOUSE
Description:Neurotensin 1 NTSR1 MOUSE::A2ACT4
Residue:424
BDBM50130880
NameBDBM50130880
Synonyms:CHEMBL407196 neurotensin pGlu-Leu-Tyr-Glu-Asn-Lys-Pro-Arg-Arg-Pro-Tyr-Ile-Leu-OH
TypeSmall organic molecule
Emp. Form.C78H121N21O20
Mol. Mass.1672.924
SMILES[#6]-[#6]-[#6@H](-[#6])-[#6@H](-[#7]-[#6](=O)-[#6@H](-[#6]-c1ccc(-[#8])cc1)-[#7]-[#6](=O)-[#6@@H]-1-[#6]-[#6]-[#6]-[#7]-1-[#6](=O)-[#6@H](-[#6]-[#6]-[#6]\[#7]=[#6](/[#7])-[#7])-[#7]-[#6](=O)-[#6@H](-[#6]-[#6]-[#6]\[#7]=[#6](\[#7])-[#7])-[#7]-[#6](=O)-[#6@@H]-1-[#6]-[#6]-[#6]-[#7]-1-[#6](=O)-[#6@H](-[#6]-[#6]-[#6]-[#6]-[#7])-[#7]-[#6](=O)-[#6@H](-[#6]-[#6](-[#7])=O)-[#7]-[#6](=O)-[#6@H](-[#6]-[#6]-[#6](-[#8])=O)-[#7]-[#6](=O)-[#6@H](-[#6]-c1ccc(-[#8])cc1)-[#7]-[#6](=O)-[#6@H](-[#6]-[#6](-[#6])-[#6])-[#7]-[#6](=O)-[#6@@H]-1-[#6]-[#6]-[#6](=O)-[#7]-1)-[#6](=O)-[#7]-[#6@@H](-[#6]-[#6](-[#6])-[#6])-[#6](-[#8])=O