Reaction Details
TargetMuscarinic acetylcholine receptor M1
LigandBDBM50281904
Substrate/Competitorn/a
Meas. Tech.ChEBML_139843
Kd 5.2±n/a nM
Citation Malaska, MJFauq, AHKozikowski, APAagaard, PJMcKinney, M Simplified analogs of himbacine displaying potent binding affinity for muscarinic receptors Bioorg Med Chem Lett3:1247-1252 (1993)    Article
 
Muscarinic acetylcholine receptor M1
Name:Muscarinic acetylcholine receptor M1
Type:Protein
Mol. Mass.:51442.54
Organism:Homo sapiens (Human)
Description:P11229
Residue:460
BDBM50281904
NameBDBM50281904
Synonyms:2-[(E)-3-(9,10-Dihydro-anthracen-9-yl)-allyl]-1-methyl-piperidine | CHEMBL22071
TypeSmall organic molecule
Emp. Form.C23H27N
Mol. Mass.317.4672
SMILESCN1CCCCC1C\C=C\C1c2ccccc2Cc2ccccc12