Reaction Details
TargetMuscarinic acetylcholine receptor M1
LigandBDBM50281908
Substrate/Competitorn/a
Meas. Tech.ChEBML_139843
Kd 679±n/a nM
Citation Malaska, MJFauq, AHKozikowski, APAagaard, PJMcKinney, M Simplified analogs of himbacine displaying potent binding affinity for muscarinic receptors Bioorg Med Chem Lett3:1247-1252 (1993)    Article
 
Muscarinic acetylcholine receptor M1
Name:Muscarinic acetylcholine receptor M1
Type:Protein
Mol. Mass.:51442.54
Organism:Homo sapiens (Human)
Description:P11229
Residue:460
BDBM50281908
NameBDBM50281908
Synonyms:2-((E)-2-Anthracen-9-yl-vinyl)-1-methyl-piperidine | CHEMBL22962
TypeSmall organic molecule
Emp. Form.C22H23N
Mol. Mass.301.4247
SMILESCN1CCCCC1\C=C\c1c2ccccc2cc2ccccc12