Reaction Details
TargetGag-Pol polyprotein [489-587]
LigandBDBM50282098
Substrate/Competitorn/a
Meas. Tech.ChEMBL_159319 (CHEMBL769372)
IC50 30±n/a nM
Citation Trova, MPBabine, REByrn, RACasscles, WTHastings, RCHsu, GCJirousek, MRJohnson, BDKerwar, SSSchow, SRWissner, AZhang, NWick, MM Synthesis and biological evaluation of a series of HIV-1 protease inhibitors Bioorg Med Chem Lett3:1595-1600 (1993)    Article
 
Gag-Pol polyprotein [489-587]
Name:Gag-Pol polyprotein [489-587]
Type:Enzyme Subunit
Mol. Mass.:10781.16
Organism:Human immunodeficiency virus type 1
Description:P04585[489-587]
Residue:99
BDBM50282098
NameBDBM50282098
Synonyms:1-((R)-4-{(1S,2S)-1-[(1H-Benzoimidazol-2-ylmethyl)-carbamoyl]-2-methyl-butylcarbamoyl}-2-hydroxy-5-phenyl-pentyl)-piperidine-2-carboxylic acid tert-butylamide | CHEMBL40829
TypeSmall organic molecule
Emp. Form.C36H52N6O4
Mol. Mass.632.8359
SMILESCC[C@H](C)[C@H](NC(=O)[C@@H](CC(O)CN1CCCCC1C(=O)NC(C)(C)C)Cc1ccccc1)C(=O)NCc1nc2ccccc2[nH]1