Reaction Details
TargetType-1 angiotensin II receptor B
LigandBDBM50030727
Substrate/Competitorn/a
Meas. Tech.ChEMBL_34824 (CHEMBL648758)
IC50 0.31±n/a nM
Citation Chang, LLAshton, WTFlanagan, KLNaylor, EMChakravarty, PKPatchett, AAGreenlee, WJBendesky, RJChen, TBFaust, KAKling, PJSchaffer, LWSchorn, TWZingaro, GJChang, RSLotti, VJKivlighn, SDSiegl, PK Triazolinones as nonpeptide angiotensin II antagonists. 2. discovery of a potent and orally active triazolinone acylsulfonamide Bioorg Med Chem Lett4:115-120 (1994)    Article
 
Type-1 angiotensin II receptor B
Name:Type-1 angiotensin II receptor B
Type:Enzyme Catalytic Domain
Mol. Mass.:40929.44
Organism:RAT
Description:Angiotensin II AT1B 0 RAT::P29089
Residue:359
BDBM50030727
NameBDBM50030727
Synonyms:4''-[3-Butyl-5-oxo-1-(2-trifluoromethyl-phenyl)-1,5-dihydro-[1,2,4]triazol-4-ylmethyl]-biphenyl-2-sulfonic acid benzoylamide CHEMBL97539 L-159913
TypeSmall organic molecule
Emp. Form.C33H29F3N4O4S
Mol. Mass.634.668
SMILESCCCCc1nn(-c2ccccc2C(F)(F)F)c(=O)n1Cc1ccc(cc1)-c1ccccc1S(=O)(=O)NC(=O)c1ccccc1