Reaction Details
TargetType-1 angiotensin II receptor B
LigandBDBM50282318
Substrate/Competitorn/a
Meas. Tech.ChEMBL_34944 (CHEMBL647787)
Ki 3.2±n/a nM
Citation Lloyd, JRyono, DEBird, JEBuote, JDelaney, CLDejneka, TDickinson, KEMoreland, SNormandin, DESkwish, SSpitzmiller, ERWaldron, TL Quinoline-4-carboxylic acids as angiotensin II receptor antagonists Bioorg Med Chem Lett4:195-200 (1994)    Article
 
Type-1 angiotensin II receptor B
Name:Type-1 angiotensin II receptor B
Type:Enzyme Catalytic Domain
Mol. Mass.:40929.44
Organism:RAT
Description:Angiotensin II AT1B 0 RAT::P29089
Residue:359
BDBM50282318
NameBDBM50282318
Synonyms:2-Methyl-3-[2'-(2H-tetrazol-5-yl)-biphenyl-4-yloxy]-quinoline-4-carboxylic acid | CHEMBL418122
TypeSmall organic molecule
Emp. Form.C24H17N5O3
Mol. Mass.423.4235
SMILESCc1nc2ccccc2c(C(O)=O)c1Oc1ccc(cc1)-c1ccccc1-c1nnn[nH]1