Reaction Details
TargetType-1 angiotensin II receptor
LigandBDBM50282464
Substrate/Competitorn/a
Meas. Tech.ChEMBL_34653 (CHEMBL649712)
IC50 0.180000±n/a nM
Citation Glinka, TWde Laszlo, SESiegl, PKChang, RSKivlighn, SDSchorn, TSFaust, KAChen, TBZingaro, GJLotti, VJGreenlee, WJ A new class of balanced AT1/AT2 angiotensin II antagonists: quinazolinone AII antagonists with acylsulfonamide and sulfonylcarbamate acidic functionalities Bioorg Med Chem Lett4:81-86 (1994)    Article
 
Type-1 angiotensin II receptor
Name:Type-1 angiotensin II receptor
Type:Enzyme Catalytic Domain
Mol. Mass.:41009.15
Organism:RABBIT
Description:ANGIOTENSIN AT1 AGTR1 RABBIT::P34976
Residue:359
BDBM50282464
NameBDBM50282464
Synonyms:CHEMBL169568 | Quinazolinone Analog
TypeSmall organic molecule
Emp. Form.C33H39N5O6S
Mol. Mass.633.758
SMILESCCCCOC(=O)NS(=O)(=O)c1ccccc1-c1ccc(Cn2c(CCC)nc3ccc(NC(=O)NCCC)cc3c2=O)cc1