Reaction Details
TargetType-1 angiotensin II receptor
LigandBDBM50282468
Substrate/Competitorn/a
Meas. Tech.ChEMBL_34653 (CHEMBL649712)
IC50 0.150000±n/a nM
Citation Glinka, TWde Laszlo, SESiegl, PKChang, RSKivlighn, SDSchorn, TSFaust, KAChen, TBZingaro, GJLotti, VJGreenlee, WJ A new class of balanced AT1/AT2 angiotensin II antagonists: quinazolinone AII antagonists with acylsulfonamide and sulfonylcarbamate acidic functionalities Bioorg Med Chem Lett4:81-86 (1994)    Article
 
Type-1 angiotensin II receptor
Name:Type-1 angiotensin II receptor
Type:Enzyme Catalytic Domain
Mol. Mass.:41009.15
Organism:RABBIT
Description:ANGIOTENSIN AT1 AGTR1 RABBIT::P34976
Residue:359
BDBM50282468
NameBDBM50282468
Synonyms:4'-[2-Butyl-6-(3-isopropyl-ureido)-4-oxo-4H-quinazolin-3-ylmethyl]-biphenyl-2-sulfonic acid benzoylamide | CHEMBL352771
TypeSmall organic molecule
Emp. Form.C36H37N5O5S
Mol. Mass.651.774
SMILESCCCCc1nc2ccc(NC(=O)NC(C)C)cc2c(=O)n1Cc1ccc(cc1)-c1ccccc1S(=O)(=O)NC(=O)c1ccccc1