Reaction Details
TargetGag-Pol polyprotein [489-587]
LigandBDBM50282534
Substrate/Competitorn/a
Meas. Tech.ChEMBL_79799 (CHEMBL696059)
Ki 8±n/a nM
Citation Dorsselaer, VVSchirlin, DTarnus, CTaylor, DLTyms, ASWeber, FBaltzer, SRemy, JMBrennan, TJanowick, D Increased antiviral activity of HIV protease inhibitors of the difluorostatone type bearing (R)-valinol derivatives as novel c-termini Bioorg Med Chem Lett4:1213-1218 (1994)    Article
 
Gag-Pol polyprotein [489-587]
Name:Gag-Pol polyprotein [489-587]
Type:Enzyme Subunit
Mol. Mass.:10781.16
Organism:Human immunodeficiency virus type 1
Description:P04585[489-587]
Residue:99
BDBM50282534
NameBDBM50282534
Synonyms:CHEMBL21095 | {(S)-1-[1-(4-Benzyloxy-benzyl)-3-((R)-1-benzyloxymethyl-2-methyl-propylcarbamoyl)-3,3-difluoro-2-oxo-propylcarbamoyl]-2-methyl-propyl}-carbamic acid benzyl ester
TypeSmall organic molecule
Emp. Form.C43H49F2N3O7
Mol. Mass.757.8619
SMILESCC(C)[C@H](COCc1ccccc1)NC(=O)C(F)(F)C(=O)C(Cc1ccc(OCc2ccccc2)cc1)NC(=O)[C@@H](NC(=O)OCc1ccccc1)C(C)C