Reaction Details
TargetBeta-lactamase TEM
LigandBDBM50282570
Substrate/Competitorn/a
Meas. Tech.ChEBML_164508
Ki 58000±n/a nM
Citation Martin, RGold, MJones, J Inhibition of the RTEM-1 β-lactamase by boronic acids Bioorg Med Chem Lett4:1229-1234 (1994)    Article
 
Beta-lactamase TEM
Name:Beta-lactamase TEM
Type:Enzyme
Mol. Mass.:31512.33
Organism:Escherichia coli
Description:P62593
Residue:286
BDBM50282570
NameBDBM50282570
Synonyms:2-(4-Methylphenyl)ethyl boronic acid | CHEMBL20678
TypeSmall organic molecule
Emp. Form.C9H13BO2
Mol. Mass.164.009
SMILESCc1ccc(CCB(O)O)cc1