Reaction Details
TargetBeta-lactamase TEM
LigandBDBM50282575
Substrate/Competitorn/a
Meas. Tech.ChEBML_164508
Ki 50000±n/a nM
Citation Martin, RGold, MJones, J Inhibition of the RTEM-1 β-lactamase by boronic acids Bioorg Med Chem Lett4:1229-1234 (1994)    Article
 
Beta-lactamase TEM
Name:Beta-lactamase TEM
Type:Enzyme
Mol. Mass.:31512.33
Organism:Escherichia coli
Description:P62593
Residue:286
BDBM50282575
NameBDBM50282575
Synonyms:2-(3-Methoxyphenyl)ethyl boronic acid | CHEMBL281783
TypeSmall organic molecule
Emp. Form.C9H13BO3
Mol. Mass.180.009
SMILESCOc1cccc(CCB(O)O)c1