Reaction Details
TargetProtein kinase C epsilon type
LigandBDBM50282633
Substrate/Competitorn/a
Meas. Tech.ChEMBL_160964 (CHEMBL769125)
IC50 105±n/a nM
Citation Davis, PDHallam, TJHarris, WHill, CHLawton, GNixon, JSSmith, JLVesey, DRWilkinson, SE Bisindolylmaleimide inhibitors of protein kinase C. Further conformational restriction of a tertiary amine side chain. Bioorg Med Chem Lett4:1303-1308 (1994)    Article
 
Protein kinase C epsilon type
Name:Protein kinase C epsilon type
Type:PROTEIN
Mol. Mass.:83483.06
Organism:Rattus norvegicus
Description:ChEMBL_160964
Residue:737
BDBM50282633
NameBDBM50282633
Synonyms:(S)-3-(8-((dimethylamino)methyl)-6,7,8,9-tetrahydropyrido[1,2-a]indol-10-yl)-4-(1-methyl-1H-indol-3-yl)-1H-pyrrole-2,5-dione CHEMBL26501 | Ro-32-0432
TypeSmall organic molecule
Emp. Form.C28H28N4O2
Mol. Mass.452.5475
SMILESCN(C)C[C@H]1CCn2c(C1)c(C1=C(C(=O)NC1=O)c1cn(C)c3ccccc13)c1ccccc21